+ Antworten
Seite 24 von 24 ErsteErste ... 14222324
Ergebnis 231 bis 235 von 235
  1. #231
    Erfahrener Benutzer Avatar von turulbird
    Registriert seit
    01.09.2012
    Beiträge
    117
    Thanks
    50
    Thanked 2 Times in 2 Posts
    Hi!

    The micom patch not work, (the previous one was good, build and flash no error):


    Code:
    Start build of driver.
    make -j3  -C /home/turulbird/buildsystem-Albis-Audioniek/build_tmp/linux-sh4-2.6.32.71_stm24_0217 ARCH=sh CONFIG_DEBUG_SECTION_MISMATCH=y \
        CONFIG_MODULES_PATH=/home/turulbird/buildsystem-Albis-Audioniek/tufsbox/cross/target \
        KERNEL_LOCATION=/home/turulbird/buildsystem-Albis-Audioniek/build_tmp/linux-sh4-2.6.32.71_stm24_0217 \
        DRIVER_TOPDIR=/home/turulbird/buildsystem-Albis-Audioniek/driver \
        M=/home/turulbird/buildsystem-Albis-Audioniek/driver \
         UFS913=ufs913 \
        CROSS_COMPILE=sh4-linux- \
        modules
      CC [M]  /home/turulbird/buildsystem-Albis-Audioniek/driver/boxtype/boxtype.o
      CC [M]  /home/turulbird/buildsystem-Albis-Audioniek/driver/avs/tools.o
      CC [M]  /home/turulbird/buildsystem-Albis-Audioniek/driver/bpamem/bpamem.o
      CC [M]  /home/turulbird/buildsystem-Albis-Audioniek/driver/avs/ak4705.o
      CC [M]  /home/turulbird/buildsystem-Albis-Audioniek/driver/cec/cec_main.o
      CC [M]  /home/turulbird/buildsystem-Albis-Audioniek/driver/cic/ufs9xx_cic/ufs9xx_cic.o
      CC [M]  /home/turulbird/buildsystem-Albis-Audioniek/driver/avs/ak4708.o
      CC [M]  /home/turulbird/buildsystem-Albis-Audioniek/driver/cec/cec_worker.o
      CC [M]  /home/turulbird/buildsystem-Albis-Audioniek/driver/avs/avs_core.o
      LD [M]  /home/turulbird/buildsystem-Albis-Audioniek/driver/cic/ufs913_cic.o
      CC [M]  /home/turulbird/buildsystem-Albis-Audioniek/driver/cec/cec_opcodes.o
      CC [M]  /home/turulbird/buildsystem-Albis-Audioniek/driver/avs/stv6412.o
      CC [M]  /home/turulbird/buildsystem-Albis-Audioniek/driver/cpu_frequ/cpu_frequ.o
      CC [M]  /home/turulbird/buildsystem-Albis-Audioniek/driver/cec/cec_internal.o
      CC [M]  /home/turulbird/buildsystem-Albis-Audioniek/driver/avs/cxa2161.o
      CC [M]  /home/turulbird/buildsystem-Albis-Audioniek/driver/e2_proc/e2_proc_main.o
      CC [M]  /home/turulbird/buildsystem-Albis-Audioniek/driver/cec/cec_proc.o
      CC [M]  /home/turulbird/buildsystem-Albis-Audioniek/driver/avs/fake_avs.o
      LD [M]  /home/turulbird/buildsystem-Albis-Audioniek/driver/e2_proc/e2_proc.o
      CC [M]  /home/turulbird/buildsystem-Albis-Audioniek/driver/cec/cec_rc.o
      CC [M]  /home/turulbird/buildsystem-Albis-Audioniek/driver/cec/cec_dev.o
      CC [M]  /home/turulbird/buildsystem-Albis-Audioniek/driver/avs/stv6417.o
      CC [M]  /home/turulbird/buildsystem-Albis-Audioniek/driver/avs/stv6418.o
      LD [M]  /home/turulbird/buildsystem-Albis-Audioniek/driver/cec/cec.o
      CC [M]  /home/turulbird/buildsystem-Albis-Audioniek/driver/frontcontroller/kathrein_micom/kathrein_micom_file.o
      CC [M]  /home/turulbird/buildsystem-Albis-Audioniek/driver/avs/avs_none.o
      CC [M]  /home/turulbird/buildsystem-Albis-Audioniek/driver/avs/avs_pio.o
      CC [M]  /home/turulbird/buildsystem-Albis-Audioniek/driver/avs/vip2_avs.o
      CC [M]  /home/turulbird/buildsystem-Albis-Audioniek/driver/avs/vip1_avs.o
    /home/turulbird/buildsystem-Albis-Audioniek/driver/frontcontroller/kathrein_micom/kathrein_micom_file.c:54:19: fatal error: micom.h: No such file or directory
     #include "micom.h"
                       ^
    compilation terminated.
    scripts/Makefile.build:229: recipe for target '/home/turulbird/buildsystem-Albis-Audioniek/driver/frontcontroller/kathrein_micom/kathrein_micom_file.o' failed
    make[4]: *** [/home/turulbird/buildsystem-Albis-Audioniek/driver/frontcontroller/kathrein_micom/kathrein_micom_file.o] Error 1
    scripts/Makefile.build:365: recipe for target '/home/turulbird/buildsystem-Albis-Audioniek/driver/frontcontroller/kathrein_micom' failed
    make[3]: *** [/home/turulbird/buildsystem-Albis-Audioniek/driver/frontcontroller/kathrein_micom] Error 2
    scripts/Makefile.build:365: recipe for target '/home/turulbird/buildsystem-Albis-Audioniek/driver/frontcontroller' failed
    make[2]: *** [/home/turulbird/buildsystem-Albis-Audioniek/driver/frontcontroller] Error 2
    make[2]: *** Waiting for unfinished jobs....
      CC [M]  /home/turulbird/buildsystem-Albis-Audioniek/driver/avs/stv6419.o
      LD [M]  /home/turulbird/buildsystem-Albis-Audioniek/driver/avs/avs.o
    Makefile:1429: recipe for target '_module_/home/turulbird/buildsystem-Albis-Audioniek/driver' failed
    make[1]: *** [_module_/home/turulbird/buildsystem-Albis-Audioniek/driver] Error 2
    make/driver.mk:19: recipe for target '/home/turulbird/buildsystem-Albis-Audioniek/.deps/driver' failed
    make: *** [/home/turulbird/buildsystem-Albis-Audioniek/.deps/driver] Error 2
    How to create rootfs.img?...



  2. #232
    Benutzer
    Registriert seit
    05.05.2012
    Beiträge
    83
    Thanks
    226
    Thanked 37 Times in 16 Posts
    Erledigt....
    Geändert von ghani (19.02.2019 um 04:45 Uhr)
    DREAMBOX 900UHD + IPBOX 900HD + IPBOX 91HD


  3. #233
    Benutzer
    Registriert seit
    05.05.2012
    Beiträge
    83
    Thanks
    226
    Thanked 37 Times in 16 Posts

    Ausrufezeichen

    problem geloest thx audioniek
    Geändert von ghani (22.02.2019 um 22:50 Uhr)
    DREAMBOX 900UHD + IPBOX 900HD + IPBOX 91HD


  4. #234
    Neuer Benutzer
    Registriert seit
    18.12.2018
    Beiträge
    8
    Thanks
    1
    Thanked 1 Time in 1 Post
    Hello My repo was building fine for adb_box few weeks ago. Now after git pull it is failing
    Anyone know how to solve ?

    Code:
    Start build of dvbsnoop d3f134b.
    Generating configuration files for dvbsnoop, please wait....
      aclocal
      autoconf
      automake --add-missing
    configure.ac:5: installing './compile'
    configure.ac:2: installing './install-sh'
    configure.ac:2: installing './missing'
    Makefile.am: installing './INSTALL'
    src/Makefile.am: installing './depcomp'
    src/bitdata/Makefile.am:14: warning: variable 'libbitdata_LDADD' is defined but no program or
    src/bitdata/Makefile.am:14: library has 'libbitdata' as canonical name (possible typo)
    Making all in src
    Making all in dvb_api
      CC       dmx_pes.o
      CC       dmx_sect.o
      CC       dmx_ts.o
      CC       dmx_tspidscan.o
      CC       dmx_tspidbandwidth.o
      CC       dmx_error.o
      CC       fe_signal.o
      CC       fe_info.o
      CC       fe_misc.o
    fe_misc.c: In function 'print_FE_BasicCapabilities':
    fe_misc.c:242:22: error: 'FE_CAN_TURBO_FEC' undeclared (first use in this function)
           if (fi.caps &  FE_CAN_TURBO_FEC)          out_nl (v,"FE_CAN_TURBO_FEC");
                          ^
    fe_misc.c:242:22: note: each undeclared identifier is reported only once for each function it appears in
    fe_misc.c: In function 'festr_FE_bandwidth':
    fe_misc.c:520:9: error: 'BANDWIDTH_5_MHZ' undeclared (first use in this function)
        case BANDWIDTH_5_MHZ:     s = "5 MHz"; break;
             ^
    fe_misc.c:521:9: error: 'BANDWIDTH_10_MHZ' undeclared (first use in this function)
        case BANDWIDTH_10_MHZ:    s = "10 MHz"; break;
             ^
    fe_misc.c:522:9: error: 'BANDWIDTH_1_712_MHZ' undeclared (first use in this function)
        case BANDWIDTH_1_712_MHZ: s = "1.712 MHz"; break;
             ^
    fe_misc.c: In function 'festr_FE_transmit_mode':
    fe_misc.c:538:9: error: 'TRANSMISSION_MODE_1K' undeclared (first use in this function)
        case TRANSMISSION_MODE_1K:     s = "1k mode"; break;
             ^
    fe_misc.c:539:9: error: 'TRANSMISSION_MODE_16K' undeclared (first use in this function)
        case TRANSMISSION_MODE_16K:    s = "16k mode"; break;
             ^
    fe_misc.c:540:9: error: 'TRANSMISSION_MODE_32K' undeclared (first use in this function)
        case TRANSMISSION_MODE_32K:    s = "32k mode"; break;
             ^
    fe_misc.c: In function 'festr_FE_guard_interval':
    fe_misc.c:562:9: error: 'GUARD_INTERVAL_1_128' undeclared (first use in this function)
        case GUARD_INTERVAL_1_128:  s = "1/128"; break;
             ^
    fe_misc.c:563:9: error: 'GUARD_INTERVAL_19_128' undeclared (first use in this function)
        case GUARD_INTERVAL_19_128: s = "19/128"; break;
             ^
    fe_misc.c:564:9: error: 'GUARD_INTERVAL_19_256' undeclared (first use in this function)
        case GUARD_INTERVAL_19_256: s = "19/256"; break;
             ^
    make[3]: *** [Makefile:357: fe_misc.o] Error 1
    make[2]: *** [Makefile:549: all-recursive] Error 1
    make[1]: *** [Makefile:334: all-recursive] Error 1
    make: *** [make/contrib-apps.mk:1604: /home/pablocool/git/Audioniek/buildsystem/.deps/dvbsnoop] Błąd 2


  5. #235
    Neuer Benutzer
    Registriert seit
    18.12.2018
    Beiträge
    8
    Thanks
    1
    Thanked 1 Time in 1 Post
    On another machine different error:

    Code:
    Patching remote control files... done.
    Build preparation for OpenPLi complete.
    
    
    libtoolize: putting auxiliary files in '.'.
    libtoolize: copying file './ltmain.sh'
    libtoolize: putting macros in AC_CONFIG_MACRO_DIRS, 'm4'.
    libtoolize: copying file 'm4/libtool.m4'
    libtoolize: copying file 'm4/ltoptions.m4'
    libtoolize: copying file 'm4/ltsugar.m4'
    libtoolize: copying file 'm4/ltversion.m4'
    libtoolize: copying file 'm4/lt~obsolete.m4'
    configure.ac:9: installing './compile'
    configure.ac:14: installing './config.guess'
    configure.ac:14: installing './config.sub'
    configure.ac:2: installing './install-sh'
    configure.ac:2: installing './missing'
    Makefile.am: installing './INSTALL'
    Makefile.am:6: installing './py-compile'
    lib/Makefile.am: installing './depcomp'
    configure: WARNING: unrecognized options: --enable-adb_box, --with-gstversion, --enable-mediafwgstreamer, --enable-libeplayer3
    config.status: error: in `/home/pablocool/git/Audioniek/buildsystem/build_source/enigma2':
    config.status: error: Something went wrong bootstrapping makefile fragments
        for automatic dependency tracking.  Try re-running configure with the
        '--disable-dependency-tracking' option to at least be able to build
        the package (albeit without support for automatic dependency tracking).
    See `config.log' for more details
    make: *** [make/enigma2.mk:188: /home/pablocool/git/Audioniek/buildsystem/build_source/enigma2/config.status] Błąd 1
    and after resume try:
    Code:
    pablocool@serwer ~/git/Audioniek/buildsystem $ ./build
    make  all-recursive
    Making all in include
    make[3]: Nothing to be done for 'all'.
    Making all in lib
    Makefile:3404: .deps/python/enigma_python.Pcpp: No such file or directory
    make[3]: *** No rule to make target '.deps/python/enigma_python.Pcpp'.  Stop.
    make[2]: *** [Makefile:601: all-recursive] Error 1
    make[1]: *** [Makefile:444: all] Error 2
    make: *** [make/enigma2.mk:210: /home/pablocool/git/Audioniek/buildsystem/.deps/enigma2.do_compile] Błąd 2
    Geändert von pablocool (15.03.2019 um 20:10 Uhr)


Berechtigungen

  • Neue Themen erstellen: Ja
  • Themen beantworten: Ja
  • Anhänge hochladen: Ja
  • Beiträge bearbeiten: Ja
  •