+ Antworten
Seite 28 von 29 ErsteErste ... 1826272829 LetzteLetzte
Ergebnis 271 bis 280 von 283
  1. #271
    Neuer Benutzer
    Registriert seit
    04.07.2012
    Beiträge
    29
    Thanks
    9
    Thanked 28 Times in 20 Posts
    ++++++++++++++++++++++++++++++++++++++++++++++++++ +++++++++++++++++++++
    +
    + Summary
    + =======
    +
    + Receiver : hs7429
    + Linux version : linux-sh4-2.6.32-71
    + Kernel patch level : P0217
    + Image : Tvheadend
    + Will run in/on : flash
    +
    ++++++++++++++++++++++++++++++++++++++++++++++++++ +++++++++++++++++++++


    -- Prepare root -------------------------------------------------------


    Prepare Tvheadend root for hs7429.




    Root preparation completed.




    -- ERROR! -------------------------------------------------------------


    !!! ERROR: DEVS ARE MISSING !!!
    APPARENTLY MAKEDEV IN prepare_root.sh FAILED.


    Exiting...
    -----------------------------------------------------------------------

  2. The Following User Says Thank You to sadaghiani For This Useful Post:



  3. #272
    Neuer Benutzer
    Registriert seit
    18.12.2018
    Beiträge
    21
    Thanks
    1
    Thanked 8 Times in 8 Posts
    Same error for me for config:

    KBUILD_VERBOSE=normal
    BOXTYPE=adb_box
    KERNEL_STM=p0217
    IMAGE=neutrino
    FLAVOUR=neutrino-mp-tangos
    PLUGINS_NEUTRINO=Yes
    OPTIMIZATIONS=size
    MEDIAFW=buildinplayer
    EXTERNAL_LCD=none
    DESTINATION=flash

  4. The Following User Says Thank You to pablocool For This Useful Post:



  5. #273
    Neuer Benutzer
    Registriert seit
    18.12.2018
    Beiträge
    21
    Thanks
    1
    Thanked 8 Times in 8 Posts
    "Build of neutrino-mp-tangos for adb_box successfully completed."

    Thank you for fix !

  6. The Following User Says Thank You to pablocool For This Useful Post:



  7. #274
    Neuer Benutzer
    Registriert seit
    04.07.2012
    Beiträge
    29
    Thanks
    9
    Thanked 28 Times in 20 Posts
    -- Result -------------------------------------------------------------


    Output file(s) created in /home/amir/buildsystem/flash/out:


    total 37M
    -rw-r--r-- 1 19M Dec 2 13:57 hs7429_neutrino_builtin_flash_P217_CDK-rev1327_HAL-rev1562_NMP-rev14842-tangos.zip
    -rw-r--r-- 1 19M Dec 2 13:57 hs7429_neutrino_builtin_flash_R270130A0.ird
    -rw-r--r-- 1 33 Dec 2 13:57 hs7429_neutrino_builtin_flash_R270130A0.ird.md5


    -- Finished -----------------------------------------------------------

  8. The Following 2 Users Say Thank You to sadaghiani For This Useful Post:



  9. #275
    Neuer Benutzer
    Registriert seit
    05.06.2019
    Beiträge
    8
    Thanks
    3
    Thanked 4 Times in 4 Posts
    ufs910 with tvh.:



    --------------------------------------------------------------
    Build of tvheadend completed.

    ================================================== ============

    Start build of tvheadend_release.
    Copying image to release directory...install: cannot stat '/opt/buildsystem/root/release/rcS_tvheadend_ufs910': No such file or directory
    make: *** [tvheadend_release_base] Error 1


    sagemcom88:
    --------------------------------------------------------------
    Build of tvheadend completed.

    ================================================== ============

    Start build of tvheadend_release.
    Copying image to release directory...install: cannot stat '/opt/buildsystem/root/release/rcS_tvheadend_sagemcom88': No such file or directory
    make: *** [tvheadend_release_base] Error 1
    --------------------------------------------------------------


    adb_box:

    Build of tvheadend completed.

    ================================================== ============

    Start build of tvheadend_release.
    Copying image to release directory...install: cannot stat '/opt/buildsystem/root/release/rcS_tvheadend_adb_box': No such file or directory
    make: *** [tvheadend_release_base] Error 1


    for 7700 works ok
    Geändert von atari (vor einer Woche um 13:11 Uhr)

  10. The Following User Says Thank You to atari For This Useful Post:



  11. #276
    Neuer Benutzer
    Registriert seit
    04.07.2012
    Beiträge
    29
    Thanks
    9
    Thanked 28 Times in 20 Posts
    ++++++++++++++++++++++++++++++++++++++++++++++++++ +++++++++++++++++++++
    +
    + Summary
    + =======
    +
    + Receiver : hs7429
    + Linux version : linux-sh4-2.6.32-71
    + Kernel patch level : P0217
    + Image : Tvheadend
    + Will run in/on : flash
    +
    ++++++++++++++++++++++++++++++++++++++++++++++++++ +++++++++++++++++++++


    -- Prepare root -------------------------------------------------------


    Prepare Tvheadend root for hs7429.




    Root preparation completed.




    -- ERROR! -------------------------------------------------------------


    !!! ERROR: DEVS ARE MISSING !!!
    APPARENTLY MAKEDEV IN prepare_root.sh FAILED.


    Exiting...
    -----------------------------------------------------------------------

  12. The Following User Says Thank You to sadaghiani For This Useful Post:



  13. #277
    Neuer Benutzer
    Registriert seit
    04.07.2012
    Beiträge
    29
    Thanks
    9
    Thanked 28 Times in 20 Posts
    HS 7429 Flash version (Neutrino tangos)
    -----------------------------------------
    Very very smooth image without problems
    ------------------------
    setting for continius vfd inactived

  14. The Following 2 Users Say Thank You to sadaghiani For This Useful Post:



  15. #278
    Neuer Benutzer
    Registriert seit
    26.05.2012
    Beiträge
    1
    Thanks
    0
    Thanked 1 Time in 1 Post

    Build error

    After update to the latest december`s commits I get an error:

    Code:
    Starting OpenPLi Enigma2 build
    ==============================
    configure: error: Package requirements (freetype2 fribidi glib-2.0 libdvbsi++ libpng libxml-2.0 sigc++-2.0 libssl libcrypto) were not met:
    
    
    No package 'sigc++-2.0' found
    
    
    Consider adjusting the PKG_CONFIG_PATH environment variable if you
    installed software in a non-standard prefix.
    
    
    Alternatively, you may set the environment variables BASE_CFLAGS
    and BASE_LIBS to avoid the need to call pkg-config.
    See the pkg-config man page for more details.
    make/enigma2.mk:192: recipe for target '/home/uniqad/Desktop/Z/build_source/enigma2/config.status' failed
    make: *** [/home/uniqad/Desktop/Z/build_source/enigma2/config.status] Error 1

  16. The Following User Says Thank You to uniqad For This Useful Post:



  17. #279
    Neuer Benutzer
    Registriert seit
    04.07.2012
    Beiträge
    29
    Thanks
    9
    Thanked 28 Times in 20 Posts
    Code:
    Starting OpenPLi Enigma2 build
    ==============================
    
    
    Repository : https://github.com/OpenPLi/enigma2.git
    Revision   : 4d853c931badcca8d7851209c75db0a6dfe47e67
    Diff       : 2
    
    
    Cloning remote OpenPLi git... done.
    Copying local git content to build environment... done.
    Checking out revision 4d853c931badcca8d7851209c75db0a6dfe47e67... done.
    Applying diff-2 patch...
    patching file configure.ac
    patching file mytest.py
    patching file data/Makefile.am
    patching file data/skin_default/Makefile.am
    patching file data/fonts/Makefile.am
    patching file data/skin_display_default.xml
    patching file lib/base/encoding.cpp
    patching file lib/base/estring.cpp
    patching file lib/base/estring.h
    patching file lib/base/smartptr.h
    patching file lib/driver/Makefile.inc
    patching file lib/driver/hdmi_cec.cpp
    patching file lib/driver/hdmi_cec.h
    patching file lib/driver/rc.cpp
    patching file lib/driver/rcinput.cpp
    patching file lib/driver/vfd.cpp
    patching file lib/driver/vfd.h
    patching file lib/dvb/decoder.cpp
    patching file lib/dvb/demux.cpp
    patching file lib/dvb/dvb.cpp
    patching file lib/dvb/dvb.h
    patching file lib/dvb/dvbtime.cpp
    patching file lib/dvb/epgcache.cpp
    patching file lib/dvb/filepush.cpp
    patching file lib/dvb/filepush.h
    patching file lib/dvb/frontend.cpp
    patching file lib/dvb/pmt.cpp
    patching file lib/dvb/pmt.h
    patching file lib/dvb/scan.cpp
    patching file lib/dvb/streamserver.h
    patching file lib/dvb/tstools.cpp
    patching file lib/dvb/volume.cpp
    patching file lib/dvb_ci/dvbci_appmgr.cpp
    patching file lib/dvb_ci/dvbci.cpp
    patching file lib/dvb_ci/dvbci.h
    patching file lib/dvb_ci/dvbci_session.cpp
    patching file lib/gdi/accel.cpp
    patching file lib/gdi/accel.h
    patching file lib/gdi/epng.cpp
    patching file lib/gdi/fb.cpp
    patching file lib/gdi/fb.h
    patching file lib/gdi/font.cpp
    patching file lib/gdi/gfbdc.cpp
    patching file lib/gdi/glcddc.cpp
    patching file lib/gdi/glcddc.h
    patching file lib/gdi/gpixmap.cpp
    patching file lib/gdi/lcd.cpp
    patching file lib/gdi/lcd.h
    patching file lib/gdi/Makefile.inc
    patching file lib/gdi/picload.cpp
    patching file lib/gdi/stmfb.cpp
    patching file lib/gui/ewidget.cpp
    patching file lib/python/Components/Converter/RemainingToText.py
    patching file lib/python/Components/Harddisk.py
    patching file lib/python/Components/Network.py
    patching file lib/python/Components/NimManager.py
    patching file lib/python/Components/SystemInfo.py
    patching file lib/python/Components/Renderer/Makefile.am
    patching file lib/python/Components/Renderer/Progress.py
    patching file lib/python/Components/Renderer/SingleEpgList.py
    patching file lib/python/Components/UsageConfig.py
    patching file lib/python/Components/VolumeControl.py
    patching file lib/python/enigma_python.i
    patching file lib/python/Makefile.inc
    patching file lib/python/Plugins/Extensions/CuberevoVFD/__init__.py
    patching file lib/python/Plugins/Extensions/CuberevoVFD/Makefile.am
    patching file lib/python/Plugins/Extensions/CuberevoVFD/plugin.py
    patching file lib/python/Plugins/Extensions/Makefile.am
    patching file lib/python/Plugins/Extensions/TopfieldVFD/__init__.py
    patching file lib/python/Plugins/Extensions/TopfieldVFD/Makefile.am
    patching file lib/python/Plugins/Extensions/TopfieldVFD/plugin.py
    patching file lib/python/Plugins/SystemPlugins/HdmiCEC/plugin.py
    patching file lib/python/Plugins/SystemPlugins/Hotplug/plugin.py
    patching file lib/python/Plugins/SystemPlugins/Makefile.am
    patching file lib/python/Plugins/SystemPlugins/VFD-Icons/__init__.py
    patching file lib/python/Plugins/SystemPlugins/VFD-Icons/LICENSE
    patching file lib/python/Plugins/SystemPlugins/VFD-Icons/Makefile.am
    patching file lib/python/Plugins/SystemPlugins/VFD-Icons/meta/Makefile.am
    patching file lib/python/Plugins/SystemPlugins/VFD-Icons/meta/plugin_vfd-icons.xml
    patching file lib/python/Plugins/SystemPlugins/VFD-Icons/plugin.py
    patching file lib/python/Plugins/SystemPlugins/Videomode/plugin.py
    patching file lib/python/Plugins/SystemPlugins/Videomode/VideoHardware.py
    patching file lib/python/Components/AVSwitch.py
    patching file lib/python/Plugins/SystemPlugins/Videomode/VideoWizard.py
    patching file lib/python/Plugins/SystemPlugins/Videomode/videowizard.xml
    patching file lib/python/Plugins/SystemPlugins/OSDPositionSetup/overscanwizard.py
    patching file lib/python/Screens/ChannelSelection.py
    patching file lib/python/Screens/InfoBarGenerics.py
    patching file lib/python/Screens/InfoBar.py
    patching file lib/python/Screens/InstallWizard.py
    patching file lib/python/Screens/ScanSetup.py
    patching file lib/python/Screens/Standby.py
    patching file lib/python/Screens/Wizard.py
    patching file lib/python/Tools/Command.py
    patching file lib/python/Tools/HardwareInfo.py
    patching file lib/python/Tools/Makefile.am
    patching file lib/python/Tools/Profile.py
    patching file lib/service/listboxservice.cpp
    patching file lib/service/servicedvb.cpp
    patching file lib/service/servicedvbrecord.cpp
    patching file m4/ax_python_devel.m4
    patching file main/bsod.cpp
    patching file main/enigma.cpp
    patching file main/Makefile.am
    patching file tools/enigma2.sh.in
    patching file lib/python/Components/About.py
    patching file lib/python/Screens/About.py
    patching file lib/python/Tools/KeyBindings.py
    patching file lib/python/Screens/InputDeviceSetup.py
    patching file data/rc_models/rc_models.cfg
    patching file data/rc_models/Makefile.am
    Patching to diff-2 completed.
    Building VFD-drivers... done.
    
    
    Patching remote control files... done.
    Build preparation for OpenPLi complete.
    
    
    libtoolize: putting auxiliary files in '.'.
    libtoolize: copying file './ltmain.sh'
    libtoolize: putting macros in AC_CONFIG_MACRO_DIRS, 'm4'.
    libtoolize: copying file 'm4/libtool.m4'
    libtoolize: copying file 'm4/ltoptions.m4'
    libtoolize: copying file 'm4/ltsugar.m4'
    libtoolize: copying file 'm4/ltversion.m4'
    libtoolize: copying file 'm4/lt~obsolete.m4'
    configure.ac:9: installing './compile'
    configure.ac:14: installing './config.guess'
    configure.ac:14: installing './config.sub'
    configure.ac:2: installing './install-sh'
    configure.ac:2: installing './missing'
    Makefile.am: installing './INSTALL'
    Makefile.am: installing './COPYING' using GNU General Public License v3 file
    Makefile.am:     Consider adding the COPYING file to the version control system
    Makefile.am:     for your code, to avoid questions about which license your project uses
    Makefile.am:6: installing './py-compile'
    lib/Makefile.am: installing './depcomp'
    configure: WARNING: using cross tools not prefixed with host triplet
    configure: error: Package requirements (freetype2 fribidi glib-2.0 libdvbsi++ libpng libxml-2.0 sigc++-2.0 libssl libcrypto) were not met:
    
    
    No package 'sigc++-2.0' found
    
    
    Consider adjusting the PKG_CONFIG_PATH environment variable if you
    installed software in a non-standard prefix.
    
    
    Alternatively, you may set the environment variables BASE_CFLAGS
    and BASE_LIBS to avoid the need to call pkg-config.
    See the pkg-config man page for more details.
    make/enigma2.mk:192: recipe for target '/home/amir/buildsystem/build_source/enigma2/config.status' failed
    make: *** [/home/amir/buildsystem/build_source/enigma2/config.status] Error 1

  18. The Following 2 Users Say Thank You to sadaghiani For This Useful Post:



  19. #280
    Neuer Benutzer
    Registriert seit
    04.07.2012
    Beiträge
    29
    Thanks
    9
    Thanked 28 Times in 20 Posts
    -- Result -------------------------------------------------------------


    Output file(s) created in /home/amir/buildsystem/flash/out:


    total 116M
    -rw-r--r-- 1 58M Dec 4 08:44 hs7429_enigma2_gst-epl3_flash_P217_CDK-rev1331.zip
    -rw-r--r-- 1 58M Dec 4 08:44 hs7429_enigma2_gst-epl3_flash_R270130A0.ird
    -rw-r--r-- 1 33 Dec 4 08:44 hs7429_enigma2_gst-epl3_flash_R270130A0.ird.md5


    -- Finished -----------------------------------------------------------

    - - - Aktualisiert - - -

    Code:
    +++++++++++++++++++++++++++++++++++++++++++++++++++++++++++++++++++++++
    +
    +  Summary
    +  =======
    +
    +  Receiver           : hs7429
    +  Linux version      : linux-sh4-2.6.32-71
    +  Kernel patch level : P0217
    +  Image              : Tvheadend
    +  Will run in/on     : flash
    +
    +++++++++++++++++++++++++++++++++++++++++++++++++++++++++++++++++++++++
    
    
    -- Prepare root -------------------------------------------------------
    
    
     Prepare Tvheadend root for hs7429.
    
    
    
    
     Root preparation completed.
    
    
    
    
    -- ERROR! -------------------------------------------------------------
    
    
     !!! ERROR: DEVS ARE MISSING !!!
     APPARENTLY MAKEDEV IN prepare_root.sh FAILED.
    
    
     Exiting...
    -----------------------------------------------------------------------
    Geändert von sadaghiani (vor 4 Tagen um 14:12 Uhr)

  20. The Following 2 Users Say Thank You to sadaghiani For This Useful Post:



Berechtigungen

  • Neue Themen erstellen: Ja
  • Themen beantworten: Ja
  • Anhänge hochladen: Ja
  • Beiträge bearbeiten: Ja
  •