+ Antworten
Seite 24 von 26 ErsteErste ... 142223242526 LetzteLetzte
Ergebnis 231 bis 240 von 254
  1. #231
    Erfahrener Benutzer Avatar von turulbird
    Registriert seit
    01.09.2012
    Beiträge
    117
    Thanks
    50
    Thanked 2 Times in 2 Posts
    Hi!

    The micom patch not work, (the previous one was good, build and flash no error):


    Code:
    Start build of driver.
    make -j3  -C /home/turulbird/buildsystem-Albis-Audioniek/build_tmp/linux-sh4-2.6.32.71_stm24_0217 ARCH=sh CONFIG_DEBUG_SECTION_MISMATCH=y \
        CONFIG_MODULES_PATH=/home/turulbird/buildsystem-Albis-Audioniek/tufsbox/cross/target \
        KERNEL_LOCATION=/home/turulbird/buildsystem-Albis-Audioniek/build_tmp/linux-sh4-2.6.32.71_stm24_0217 \
        DRIVER_TOPDIR=/home/turulbird/buildsystem-Albis-Audioniek/driver \
        M=/home/turulbird/buildsystem-Albis-Audioniek/driver \
         UFS913=ufs913 \
        CROSS_COMPILE=sh4-linux- \
        modules
      CC [M]  /home/turulbird/buildsystem-Albis-Audioniek/driver/boxtype/boxtype.o
      CC [M]  /home/turulbird/buildsystem-Albis-Audioniek/driver/avs/tools.o
      CC [M]  /home/turulbird/buildsystem-Albis-Audioniek/driver/bpamem/bpamem.o
      CC [M]  /home/turulbird/buildsystem-Albis-Audioniek/driver/avs/ak4705.o
      CC [M]  /home/turulbird/buildsystem-Albis-Audioniek/driver/cec/cec_main.o
      CC [M]  /home/turulbird/buildsystem-Albis-Audioniek/driver/cic/ufs9xx_cic/ufs9xx_cic.o
      CC [M]  /home/turulbird/buildsystem-Albis-Audioniek/driver/avs/ak4708.o
      CC [M]  /home/turulbird/buildsystem-Albis-Audioniek/driver/cec/cec_worker.o
      CC [M]  /home/turulbird/buildsystem-Albis-Audioniek/driver/avs/avs_core.o
      LD [M]  /home/turulbird/buildsystem-Albis-Audioniek/driver/cic/ufs913_cic.o
      CC [M]  /home/turulbird/buildsystem-Albis-Audioniek/driver/cec/cec_opcodes.o
      CC [M]  /home/turulbird/buildsystem-Albis-Audioniek/driver/avs/stv6412.o
      CC [M]  /home/turulbird/buildsystem-Albis-Audioniek/driver/cpu_frequ/cpu_frequ.o
      CC [M]  /home/turulbird/buildsystem-Albis-Audioniek/driver/cec/cec_internal.o
      CC [M]  /home/turulbird/buildsystem-Albis-Audioniek/driver/avs/cxa2161.o
      CC [M]  /home/turulbird/buildsystem-Albis-Audioniek/driver/e2_proc/e2_proc_main.o
      CC [M]  /home/turulbird/buildsystem-Albis-Audioniek/driver/cec/cec_proc.o
      CC [M]  /home/turulbird/buildsystem-Albis-Audioniek/driver/avs/fake_avs.o
      LD [M]  /home/turulbird/buildsystem-Albis-Audioniek/driver/e2_proc/e2_proc.o
      CC [M]  /home/turulbird/buildsystem-Albis-Audioniek/driver/cec/cec_rc.o
      CC [M]  /home/turulbird/buildsystem-Albis-Audioniek/driver/cec/cec_dev.o
      CC [M]  /home/turulbird/buildsystem-Albis-Audioniek/driver/avs/stv6417.o
      CC [M]  /home/turulbird/buildsystem-Albis-Audioniek/driver/avs/stv6418.o
      LD [M]  /home/turulbird/buildsystem-Albis-Audioniek/driver/cec/cec.o
      CC [M]  /home/turulbird/buildsystem-Albis-Audioniek/driver/frontcontroller/kathrein_micom/kathrein_micom_file.o
      CC [M]  /home/turulbird/buildsystem-Albis-Audioniek/driver/avs/avs_none.o
      CC [M]  /home/turulbird/buildsystem-Albis-Audioniek/driver/avs/avs_pio.o
      CC [M]  /home/turulbird/buildsystem-Albis-Audioniek/driver/avs/vip2_avs.o
      CC [M]  /home/turulbird/buildsystem-Albis-Audioniek/driver/avs/vip1_avs.o
    /home/turulbird/buildsystem-Albis-Audioniek/driver/frontcontroller/kathrein_micom/kathrein_micom_file.c:54:19: fatal error: micom.h: No such file or directory
     #include "micom.h"
                       ^
    compilation terminated.
    scripts/Makefile.build:229: recipe for target '/home/turulbird/buildsystem-Albis-Audioniek/driver/frontcontroller/kathrein_micom/kathrein_micom_file.o' failed
    make[4]: *** [/home/turulbird/buildsystem-Albis-Audioniek/driver/frontcontroller/kathrein_micom/kathrein_micom_file.o] Error 1
    scripts/Makefile.build:365: recipe for target '/home/turulbird/buildsystem-Albis-Audioniek/driver/frontcontroller/kathrein_micom' failed
    make[3]: *** [/home/turulbird/buildsystem-Albis-Audioniek/driver/frontcontroller/kathrein_micom] Error 2
    scripts/Makefile.build:365: recipe for target '/home/turulbird/buildsystem-Albis-Audioniek/driver/frontcontroller' failed
    make[2]: *** [/home/turulbird/buildsystem-Albis-Audioniek/driver/frontcontroller] Error 2
    make[2]: *** Waiting for unfinished jobs....
      CC [M]  /home/turulbird/buildsystem-Albis-Audioniek/driver/avs/stv6419.o
      LD [M]  /home/turulbird/buildsystem-Albis-Audioniek/driver/avs/avs.o
    Makefile:1429: recipe for target '_module_/home/turulbird/buildsystem-Albis-Audioniek/driver' failed
    make[1]: *** [_module_/home/turulbird/buildsystem-Albis-Audioniek/driver] Error 2
    make/driver.mk:19: recipe for target '/home/turulbird/buildsystem-Albis-Audioniek/.deps/driver' failed
    make: *** [/home/turulbird/buildsystem-Albis-Audioniek/.deps/driver] Error 2
    How to create rootfs.img?...



  2. #232
    Benutzer
    Registriert seit
    05.05.2012
    Beiträge
    83
    Thanks
    226
    Thanked 39 Times in 18 Posts
    Erledigt....
    Geändert von ghani (19.02.2019 um 04:45 Uhr)
    DREAMBOX 900UHD + IPBOX 900HD + IPBOX 91HD

  3. The Following User Says Thank You to ghani For This Useful Post:



  4. #233
    Benutzer
    Registriert seit
    05.05.2012
    Beiträge
    83
    Thanks
    226
    Thanked 39 Times in 18 Posts

    Ausrufezeichen

    problem geloest thx audioniek
    Geändert von ghani (22.02.2019 um 22:50 Uhr)
    DREAMBOX 900UHD + IPBOX 900HD + IPBOX 91HD

  5. The Following User Says Thank You to ghani For This Useful Post:



  6. #234
    Neuer Benutzer
    Registriert seit
    18.12.2018
    Beiträge
    17
    Thanks
    1
    Thanked 5 Times in 5 Posts
    Hello My repo was building fine for adb_box few weeks ago. Now after git pull it is failing
    Anyone know how to solve ?

    Code:
    Start build of dvbsnoop d3f134b.
    Generating configuration files for dvbsnoop, please wait....
      aclocal
      autoconf
      automake --add-missing
    configure.ac:5: installing './compile'
    configure.ac:2: installing './install-sh'
    configure.ac:2: installing './missing'
    Makefile.am: installing './INSTALL'
    src/Makefile.am: installing './depcomp'
    src/bitdata/Makefile.am:14: warning: variable 'libbitdata_LDADD' is defined but no program or
    src/bitdata/Makefile.am:14: library has 'libbitdata' as canonical name (possible typo)
    Making all in src
    Making all in dvb_api
      CC       dmx_pes.o
      CC       dmx_sect.o
      CC       dmx_ts.o
      CC       dmx_tspidscan.o
      CC       dmx_tspidbandwidth.o
      CC       dmx_error.o
      CC       fe_signal.o
      CC       fe_info.o
      CC       fe_misc.o
    fe_misc.c: In function 'print_FE_BasicCapabilities':
    fe_misc.c:242:22: error: 'FE_CAN_TURBO_FEC' undeclared (first use in this function)
           if (fi.caps &  FE_CAN_TURBO_FEC)          out_nl (v,"FE_CAN_TURBO_FEC");
                          ^
    fe_misc.c:242:22: note: each undeclared identifier is reported only once for each function it appears in
    fe_misc.c: In function 'festr_FE_bandwidth':
    fe_misc.c:520:9: error: 'BANDWIDTH_5_MHZ' undeclared (first use in this function)
        case BANDWIDTH_5_MHZ:     s = "5 MHz"; break;
             ^
    fe_misc.c:521:9: error: 'BANDWIDTH_10_MHZ' undeclared (first use in this function)
        case BANDWIDTH_10_MHZ:    s = "10 MHz"; break;
             ^
    fe_misc.c:522:9: error: 'BANDWIDTH_1_712_MHZ' undeclared (first use in this function)
        case BANDWIDTH_1_712_MHZ: s = "1.712 MHz"; break;
             ^
    fe_misc.c: In function 'festr_FE_transmit_mode':
    fe_misc.c:538:9: error: 'TRANSMISSION_MODE_1K' undeclared (first use in this function)
        case TRANSMISSION_MODE_1K:     s = "1k mode"; break;
             ^
    fe_misc.c:539:9: error: 'TRANSMISSION_MODE_16K' undeclared (first use in this function)
        case TRANSMISSION_MODE_16K:    s = "16k mode"; break;
             ^
    fe_misc.c:540:9: error: 'TRANSMISSION_MODE_32K' undeclared (first use in this function)
        case TRANSMISSION_MODE_32K:    s = "32k mode"; break;
             ^
    fe_misc.c: In function 'festr_FE_guard_interval':
    fe_misc.c:562:9: error: 'GUARD_INTERVAL_1_128' undeclared (first use in this function)
        case GUARD_INTERVAL_1_128:  s = "1/128"; break;
             ^
    fe_misc.c:563:9: error: 'GUARD_INTERVAL_19_128' undeclared (first use in this function)
        case GUARD_INTERVAL_19_128: s = "19/128"; break;
             ^
    fe_misc.c:564:9: error: 'GUARD_INTERVAL_19_256' undeclared (first use in this function)
        case GUARD_INTERVAL_19_256: s = "19/256"; break;
             ^
    make[3]: *** [Makefile:357: fe_misc.o] Error 1
    make[2]: *** [Makefile:549: all-recursive] Error 1
    make[1]: *** [Makefile:334: all-recursive] Error 1
    make: *** [make/contrib-apps.mk:1604: /home/pablocool/git/Audioniek/buildsystem/.deps/dvbsnoop] Błąd 2

  7. The Following User Says Thank You to pablocool For This Useful Post:



  8. #235
    Neuer Benutzer
    Registriert seit
    18.12.2018
    Beiträge
    17
    Thanks
    1
    Thanked 5 Times in 5 Posts
    On another machine different error:

    Code:
    Patching remote control files... done.
    Build preparation for OpenPLi complete.
    
    
    libtoolize: putting auxiliary files in '.'.
    libtoolize: copying file './ltmain.sh'
    libtoolize: putting macros in AC_CONFIG_MACRO_DIRS, 'm4'.
    libtoolize: copying file 'm4/libtool.m4'
    libtoolize: copying file 'm4/ltoptions.m4'
    libtoolize: copying file 'm4/ltsugar.m4'
    libtoolize: copying file 'm4/ltversion.m4'
    libtoolize: copying file 'm4/lt~obsolete.m4'
    configure.ac:9: installing './compile'
    configure.ac:14: installing './config.guess'
    configure.ac:14: installing './config.sub'
    configure.ac:2: installing './install-sh'
    configure.ac:2: installing './missing'
    Makefile.am: installing './INSTALL'
    Makefile.am:6: installing './py-compile'
    lib/Makefile.am: installing './depcomp'
    configure: WARNING: unrecognized options: --enable-adb_box, --with-gstversion, --enable-mediafwgstreamer, --enable-libeplayer3
    config.status: error: in `/home/pablocool/git/Audioniek/buildsystem/build_source/enigma2':
    config.status: error: Something went wrong bootstrapping makefile fragments
        for automatic dependency tracking.  Try re-running configure with the
        '--disable-dependency-tracking' option to at least be able to build
        the package (albeit without support for automatic dependency tracking).
    See `config.log' for more details
    make: *** [make/enigma2.mk:188: /home/pablocool/git/Audioniek/buildsystem/build_source/enigma2/config.status] Błąd 1
    and after resume try:
    Code:
    pablocool@serwer ~/git/Audioniek/buildsystem $ ./build
    make  all-recursive
    Making all in include
    make[3]: Nothing to be done for 'all'.
    Making all in lib
    Makefile:3404: .deps/python/enigma_python.Pcpp: No such file or directory
    make[3]: *** No rule to make target '.deps/python/enigma_python.Pcpp'.  Stop.
    make[2]: *** [Makefile:601: all-recursive] Error 1
    make[1]: *** [Makefile:444: all] Error 2
    make: *** [make/enigma2.mk:210: /home/pablocool/git/Audioniek/buildsystem/.deps/enigma2.do_compile] Błąd 2
    Geändert von pablocool (15.03.2019 um 20:10 Uhr)


  9. #236
    Neuer Benutzer
    Registriert seit
    18.12.2018
    Beiträge
    17
    Thanks
    1
    Thanked 5 Times in 5 Posts
    Afters hours of digging I have eventually found solution. Updating gentoo updated automake from 1.15 to 1.16
    Switching to 1.15 solves issue:
    Code:
    echo "WANT_AUTOMAKE=1.15 make yaud-enigma2" > build
    rm .deps/enigma2.do_prepare
    ./build
    
    (...)
        
    Patching PLi-HD skin completed. -------------------------------------------------------------- Build of enigma2 completed. ============================================================== Start build of enigma2_release. Copying image to release directory... done. Cleaning up... done. -------------------------------------------------------------- Build of enigma2_release completed. Processing own_build... done. Processing receiver specific own build for adb_box... done. Stripping... done. *************************************************************** Build of Enigma2 for adb_box successfully completed. ***************************************************************

  10. The Following User Says Thank You to pablocool For This Useful Post:



  11. #237
    Developer
    Registriert seit
    18.07.2012
    Ort
    Ridderkerk, Niederlande
    Beiträge
    471
    Thanks
    132
    Thanked 517 Times in 208 Posts
    I have changed make.sh to add WANT_AUTOMAKE=1.15 if running on Gentoo.

    Regards,

    Audioniek.
    Receivers: Rebox: RE-4000, 8000, 9000, 2200, 2210, 2220, 4200, 4210, 4220, 8220, 8500, SAB Unix Triple, Golden Media Spark Triplex, Amiko Alien 3, Sogno Spark Revolution, Topfield TF7710HDPVR, Kathrein UFS912, Vizyon revolution 820HD PVR, nBox BKSA/BSLA/BXZB/BZZB, Vitamin HD 5000
    Sats: Astra 1, 2 & 3, Hotbird
    Main activity: building my own E2 images for Fortis receivers


  12. #238
    Neuer Benutzer
    Registriert seit
    18.12.2018
    Beiträge
    17
    Thanks
    1
    Thanked 5 Times in 5 Posts
    We almost have it. But this is not correct:
    Code:
    cat build
    WANT_AUTOMAKE=1.15
    make yaud-enigma2
    either make it:
    Code:
    cat build
    export WANT_AUTOMAKE=1.15
    make yaud-enigma2
    or oneliner
    Code:
    cat build
    WANT_AUTOMAKE=1.15 make yaud-enigma2
    I think easiest solution would be to have in make.sh
    Code:
    echo -n "WANT_AUTOMAKE=1.15 " > $CURDIR/build


  13. #239
    Neuer Benutzer
    Registriert seit
    18.12.2018
    Beiträge
    17
    Thanks
    1
    Thanked 5 Times in 5 Posts
    Unfortunately latest E2 revision " 2*) Sat, 23 Mar 2019 19:40 - E2 OpenPLi any framework e2e791cf8426028d8cc225d5fa2bceb55df634f5"
    Code:
    KBUILD_VERBOSE=normal
    BOXTYPE=adb_box
    KERNEL_STM=p0217
    OPTIMIZATIONS=size
    IMAGE=enigma2-wlandriver
    E2_DIFF=2
    E2_REVISION=e2e791cf8426028d8cc225d5fa2bceb55df634f5
    MEDIAFW=gst-eplayer3
    EXTERNAL_LCD=none
    DESTINATION=flash
    does not work. There is a problem I have audio but no video. OSD (menus etc) is visible however no stream video. Revision from december: "3) Mon, 10 Dec 2018 19:01 - E2 OpenPLi any framework a8e73e1874100aad76e44117b74543fb4018ff61" is working fine. What is worth mentioning this was done on latest buildsystem/apps/driver repos.

    I have checked and this is no kernel/driver issue. I naively copied enigma2 binary from 12.2018 rev to this from 03.2019, but of course crashed because of /usr/lib/enigma2/python stuff not matching. So I copied that whole dir also. And also crash. Then I copied /usr/lib. Also crash. I eventually suceeded copying whole /usr dir.

    Do you suspect what may it be? gstreamer maybe or eplayer3?


  14. #240
    Neuer Benutzer
    Registriert seit
    18.12.2018
    Beiträge
    17
    Thanks
    1
    Thanked 5 Times in 5 Posts
    Probably this is the reason:

    (gst-plugin-scanner:703): GStreamer-WARNING **: Failed to load plugin '/usr/lib/gstreamer-1.0/libgstalsa.so': /usr/lib/gstreamer-1.0/libgstalsa.so: undefined symbol: snd_pcm_get_chmap

    What can we do with it ?


Berechtigungen

  • Neue Themen erstellen: Ja
  • Themen beantworten: Ja
  • Anhänge hochladen: Ja
  • Beiträge bearbeiten: Ja
  •